{"text_format":"1","workbook":"xlsx","n_sheets":11,"sheets":["Introduction","Instructions","Waste calculation","Waste hierarchy calculation","Waste adjustments","Reduction","Data sources","Summary of Results","Checklist","Assessor footprint","Emissions Factors"],"not_rendered":{"charts":0,"images":3,"macros":1,"external_links":0,"defined_names":6,"comments":3,"pivot_tables":0},"unopened":[],"bounds":{"document_bytes":16777216,"sheet_cells":100000,"rows_first":2000,"rows_last":500,"rows_between":2000,"halvings":0,"cell_chars":16384,"cell_head_chars":4096},"cells_cut":0,"cells_raw":0,"read":"whole","date_system":"1900"}

{"sheet":"Introduction","index":0,"n_rows":25,"n_cols":6,"rows_kept":25,"cut":false,"hidden":false,"merged":[[4,4,4,5],[5,4,5,5]]}
[]
[]
[]
[]
[null,null,null,null,"Carbon Trust Waste Calculation - First Certification"]
[null,null,null,null,"Instructions:"]
[]
[null,null,null,null,null,"Please fill in the required information in the BLUE tabs. The ORANGE tab provides information for the assessment form . GREY tabs are for information or assessor use only"]
[null,null,null,null,null,"Within each tab, the cells are colour coded to indicate their function. The colour coding works as follows:"]
[null,null,null,null,null,"Complete"]
[null,null,null,null,null,"Automatic calculation"]
[null,null,null,null,null,"To be completed by assessor"]
[]
[null,null,null,null,null,"The 'Waste calculation' tab should be used to input all common waste arisings."]
[null,null,null,null,null,"The 'Waste Adjustments' tab should be used for data on adjustments which must be made.  "]
[null,null,null,null,null,"The 'Reduction' tab is where the reduction over the assessment period is calculated."]
[null,null,null,null,null,"The 'Data sources' tab should be used to provide references for all of the data you have entered. "]
[]
[]
[null,null,null,null,null,"Version History"]
[null,null,null,null,null,"CTCWaste_spreadsheet_v2_6"]
[null,null,null,null,null,"2014-01-01"]
[]
[null,null,null,null,null,"User agreement"]
[null,null,null,null,null,"© The Carbon Trust 2014. All rights reserved.\nAny trademarks, servicemarks or logos used in this document are the property of the Carbon Trust and copyright is licensed to the Carbon Trust.\n\nNothing in this document shall be construed as granting any licence or right to use or reproduce any of the trademarks, service marks, logos, copyright or any proprietary information in any way without the Carbon Trust’s prior written permission. The Carbon Trust enforces infringements of its intellectual property rights to the full extent permitted by law.\n\nThe Carbon Trust Certification Limited is a subsidiary of the Carbon Trust. \n"]

{"sheet":"Instructions","index":1,"n_rows":45,"n_cols":4,"rows_kept":45,"cut":false,"hidden":true,"merged":[[44,2,44,3],[31,2,31,3],[32,2,32,3],[33,2,33,3],[43,1,43,3],[34,2,34,3],[35,2,35,3],[42,1,42,2],[36,2,36,3],[18,1,18,3],[19,2,19,3],[21,1,21,3],[22,2,22,3],[12,1,12,3],[16,2,16,3],[0,1,1,3],[3,1,3,3],[14,2,14,3],[15,2,15,3],[13,2,13,3],[9,2,9,3],[10,2,10,3],[23,2,23,3],[41,2,41,3],[40,2,40,3],[30,2,30,3],[38,1,38,3],[25,1,25,3],[28,1,28,3],[39,2,39,3],[29,2,29,3],[26,2,26,3]]}
[null,"INSTRUCTIONS"]
[]
[]
[null,"General instructions"]
[null,{"$f":"MAX($B$1:B3)+1","v":1},"Sheets are colour coded:"]
[null,null,null,"Dark blue sheets must be completed"]
[null,null,null,"Light blue sheets may need to be completed"]
[null,null,null,"Grey sheets provide information only"]
[null,null,null,"No data needs to be entered, but sheets are important for checking issues and showing final output"]
[null,{"$f":"MAX($B$1:B5)+1","v":2},"On all sheets, cells are colour coded:\n - Cells required for level 1 and level 2 are pale blue \n - Cells required for level 2 only are pink \n - Orange cells are for optional information\n - Cells that calculate automatically are yellow\nNote that 'level' is a Carbon Trust Standard term, while 'Scope' is a GHG Protocol term. The two are not identical."]
[null,{"$f":"MAX($B$1:B10)+1","v":3},"The 'Comments' column should be used to provide any further information. For example:\n - Details of sources\n - Description of calculation/estimation approach and emissions factors used\n - Any other relevant information\nThe 'Notes' column contains information or instructions to help the user of the spreadsheet, and should not be edited"]
[]
[null,"On 'Footprint Calculation' Sheet:"]
[null,{"$f":"MAX($B$1:B13)+1","v":4},"Insert the end date of the compliance period (DD/MM/YYYY) in cell E9. This is the end date of the most recent year for which the footprint is measured."]
[null,{"$f":"MAX($B$1:B14)+1","v":5},"Input data for different emission sources ensuring units column (column C) is correct and noting the data source in Column I\n - For a level 1 footprint, complete all relevant pale blue cells\n - For a level 2 footprint, complete all relevant pale blue and pink cells\nUse the plus symbol to the left of the sheet for extra rows if required\nFor some sources, the units and emissions factors have been pre-filled with typical values (e.g. kWh and UK grid emissions for electricity). These values can be changed if the company reports in a different unit, but the emissions factor would also have to be changed in this case"]
[null,{"$f":"MAX($B$1:B15)+1","v":6},"Identify relevant emission factors (some common factors are listed on the 'Emissions Factors' sheets, for others use appropriate source e.g. DEFRA's Corporate Reporting Guidelines) and insert in Column D, noting the source in Column I if non-standard"]
[null,{"$f":"MAX($B$1:B16)+1","v":7},"Ensure any exported heat or electricity is reported in rows 71 & 72 (as a positive value) and use DEFRA's guidelines to calculate relevant emission factors to insert in Column D"]
[]
[null,"On 'Other emissions' Sheet:"]
[null,{"$f":"MAX($B$1:B19)+1","v":8},"If there is not enough space on the 'Footprint calculation' sheet, please record any other emissions here"]
[]
[null,"On 'CHP' Sheet:"]
[null,{"$f":"MAX($B$1:B22)+1","v":9},"This sheet should be used if emissions from CHP need to be allocated - i.e. if the organisation has a CHP plant and exports some of the heat or electricity, or if it imports energy produced from CHP elsewhere."]
[null,{"$f":"MAX($B$1:B23)+1","v":10},"Adjustments to the footprint for imports or exports automatically feed through to the 'Footprint calculation' sheet"]
[]
[null,"On 'Adjustments' Sheet:"]
[null,{"$f":"MAX($B$1:B26)+1","v":11},"In order for a like-for-like footprint to be compared across the years, the footprint must be adjusted for any structural changes (such as outsourcing, divestments, acquisitions) over the time period.  Use the 'Adjustments' sheet to calculate the footprint of the section of the organisation to be excluded \ne.g., if subsidiary X of an organisation was divested in Year -1, then the Year -2 footprint and Year -1 footprint must be adjusted downwards as if subsidiary X were never part of the footprint."]
[]
[null,"On 'Reduction' Sheet:"]
[null,{"$f":"MAX($B$1:B29)+1","v":12},"This sheet should be used for all organisations where the reduction requirement will be based on 2 or more years of data"]
{"$rows_left_out":16}
{"sheet":"Waste calculation","index":2,"n_rows":915,"n_cols":24,"rows_kept":915,"cut":false,"hidden":false,"merged":[[14,3,14,26],[20,5,22,5],[886,3,886,7],[22,22,23,22],[22,23,23,23],[22,24,23,24],[22,25,23,25]]}
[]
[]
[]
[null,null,null,"Carbon Trust Certification Limited"]
[null,null,null,"Waste Arisings Calculation"]
[]
[]
[]
[]
[]
[null,null,null,"Complete for assessment"]
[null,null,null,"Automatic calculation"]
[null,null,null,"Cells to be completed by assessor"]
[]
[null,null,null,"***PLEASE READ***\nInstructions: Please use this tab to input the organisation's waste arisings data. \nPlease note: This tab includes space for the most common waste types. If the organisation has waste arisings from sources not listed in this tab, please use the 'Other waste' tab to include these."]
[]
[null,null,null,null,null,null,"Organisation name",null,"Assessor name"]
[null,null,null,null,null,null,"Date spreadsheet completed",null,"Type of Service"]
[null,null,null,null,null,null,"Data year end date"]
[null,null,null,null,null,{"$f":"IF(SUM(H19)*SUM(H18)=0,\"\",IF(H18-H19>276,\"Error: Footprint must be completed within 9 months of compliance period end\",\"\"))","v":""}]
[null,null,null,null,null,"Units","Year -2",null,null,null,null,"Year -1",null,null,null,null,"Year 0"]
[null,null,null,null,null,null,"Year end date",null,null,null,null,"Year end date",null,null,null,null,"Year end date",null,null,null,null,null,"Activity Data Source","Assessor Comments"]
[null,null,null,null,null,null,null,null,null,null,null,null,null,null,null,null,null,null,null,null,null,null,"e.g. e.g. from waste transfer notes, software packages, or spreadsheets,  raw data evidence presented in evidence pack","e.g. explanation of data quality, large year-on-year changes,etc."]
[]
[null,null,null,"Waste Code","Waste Type","Unit","Total","Reuse","Recycle","Energy recovery","Disposal","Total","Reuse","Recycle","Energy recovery","Disposal","Total","Reuse","Recycle","Energy recovery","Disposal"]
[null,null,null,"01","WASTES RESULTING FROM EXPLORATION, MINING, QUARRYING, AND PHYSICAL AND CHEMICAL TREATMENT OF MINERALS","Tonnes",{"$f":"IF(SUM(H26:K26)=0,\"-\",SUM(H26:K26))","v":"-"},{"$f":"IF(SUM(H27:H49)=0,\"-\",SUM(H27:H49))","v":"-"},{"$f":"IF(SUM(I27:I49)=0,\"-\",SUM(I27:I49))","v":"-"},"-","-",{"$f":"IF(SUM(M26:P26)=0,\"-\",SUM(M26:P26))","v":"-"},{"$f":"IF(SUM(M27:M49)=0,\"-\",SUM(M27:M49))","v":"-"},{"$f":"IF(SUM(N27:N49)=0,\"-\",SUM(N27:N49))","v":"-"},"-","-",{"$f":"IF(SUM(R26:U26)=0,\"-\",SUM(R26:U26))","v":"-"},{"$f":"IF(SUM(R27:R49)=0,\"-\",SUM(R27:R49))","v":"-"},{"$f":"IF(SUM(S27:S49)=0,\"-\",SUM(S27:S49))","v":"-"},"-","-"]
[null,null,null,"01 01 01 "," wastes from mineral metalliferous excavation","Tonnes",{"$f":"IF(SUM(H27:K27)=0,\"-\",SUM(H27:K27))","v":"-"},null,null,null,null,{"$f":"IF(SUM(M27:P27)=0,\"-\",SUM(M27:P27))","v":"-"},null,null,null,null,{"$f":"IF(SUM(R27:U27)=0,\"-\",SUM(R27:U27))","v":"-"}]
[null,null,null,"01 01 02 ","wastes from mineral non-metalliferous excavation","Tonnes","-",null,null,null,null,"-",null,null,null,null,"-"]
[null,null,null,"01 03 04*  "," acid-generating tailings from processing of sulphide ore","Tonnes","-",null,null,null,null,"-",null,null,null,null,"-"]
[null,null,null,"01 03 05*   ","other tailings containing dangerous substances","Tonnes","-",null,null,null,null,"-",null,null,null,null,"-"]
{"$rows_left_out":886}
{"sheet":"Waste hierarchy calculation","index":3,"n_rows":24,"n_cols":11,"rows_kept":24,"cut":false,"hidden":false,"merged":[]}
[]
[]
[]
[null,null,null,"Carbon Trust Certification Limited"]
[null,null,null,"Waste Hierarchy Calculation"]
[]
[]
[null,null,null,null,"Total","Reuse","Recycle","Energy recovery","Disposal"]
[null,null,null,"Year -2",{"$f":"IF('Waste calculation'!G915=\"-\",\"-\",('Waste calculation'!G915))","v":"-"},{"$f":"IF('Waste calculation'!H915=\"-\",\"-\",('Waste calculation'!H915))","v":"-"},{"$f":"IF('Waste calculation'!I915=\"-\",\"-\",('Waste calculation'!I915))","v":"-"},{"$f":"IF('Waste calculation'!J915=\"-\",\"-\",('Waste calculation'!J915))","v":"-"},{"$f":"IF('Waste calculation'!K915=\"-\",\"-\",('Waste calculation'!K915))","v":"-"}]
[null,null,null,"Year -1",{"$f":"IF('Waste calculation'!L915=\"-\",\"-\",('Waste calculation'!L915))","v":"-"},{"$f":"IF('Waste calculation'!M915=\"-\",\"-\",('Waste calculation'!M915))","v":"-"},{"$f":"IF('Waste calculation'!N915=\"-\",\"-\",('Waste calculation'!N915))","v":"-"},{"$f":"IF('Waste calculation'!O915=\"-\",\"-\",('Waste calculation'!O915))","v":"-"},{"$f":"IF('Waste calculation'!P915=\"-\",\"-\",('Waste calculation'!P915))","v":"-"}]
[null,null,null,"Year 0",{"$f":"IF('Waste calculation'!Q915=\"-\",\"-\",('Waste calculation'!Q915))","v":"-"},{"$f":"IF('Waste calculation'!R915=\"-\",\"-\",('Waste calculation'!R915))","v":"-"},{"$f":"IF('Waste calculation'!S915=\"-\",\"-\",('Waste calculation'!S915))","v":"-"},{"$f":"IF('Waste calculation'!T915=\"-\",\"-\",('Waste calculation'!T915))","v":"-"},{"$f":"IF('Waste calculation'!U915=\"-\",\"-\",('Waste calculation'!U915))","v":"-"}]
[]
[null,null,null,null,"Total","Reuse","Recycle","Energy recovery","Disposal"]
[null,null,null,"Year -2",{"$f":"E9","v":"-"},5,3,2,1]
[null,null,null,"Year -1",{"$f":"E10","v":"-"},5,3,2,1]
[null,null,null,"Year 0","-",5,3,2,1]
[]
[null,null,null,null,"Total","Reuse","Recycle","Energy recovery","Disposal","Weighted sum","Weighted score"]
[null,null,null,"Year -2",{"$f":"E9","v":"-"},{"$f":"IF(ISERROR(F9*F14),\"-\",F9*F14)","v":"-"},{"$f":"IF(ISERROR(G9*G14),\"-\",G9*G14)","v":"-"},"-","-",{"$f":"IF(SUM(F19:I19)=0,\"-\",SUM(F19:I19))","v":"-"},{"$f":"IF(ISERROR(E19/J19),\"-\",E19/J19)","v":"-"}]
[null,null,null,"Year -1",{"$f":"E10","v":"-"},{"$f":"IF(ISERROR(F10*F15),\"-\",F10*F15)","v":"-"},"-","-","-",{"$f":"IF(SUM(F20:I20)=0,\"-\",SUM(F20:I20))","v":"-"},{"$f":"IF(ISERROR(E20/J20),\"-\",E20/J20)","v":"-"}]
[null,null,null,"Year 0","-","-","-","-","-","-","-"]
[]
[null,null,null,"Average Y-2 to Y-1","Year 0","Historical vs baseline score","Waste hierarchy score"]
[null,null,null,{"$f":"IF(ISERROR(AVERAGE(K19:K20)),\"-\",AVERAGE(K19:K20))","v":"-"},{"$f":"K21","v":"-"},{"$f":"IF(ISERROR(D24-E24),\"-\",D24-E24)","v":"-"},{"$f":"IF(ISERROR(F24/D24),\"-\",F24/D24)","v":"-"}]

{"sheet":"Waste adjustments","index":4,"n_rows":919,"n_cols":24,"rows_kept":919,"cut":false,"hidden":false,"merged":[[890,3,890,7],[14,3,14,26],[24,5,26,5],[26,22,27,22],[26,23,27,23],[26,24,27,24],[26,25,27,25]]}
[]
[]
[]
[null,null,null,"Carbon Trust Certification Limited"]
[null,null,null,"Waste Arisings Calculation"]
[]
[]
[]
[]
[]
[null,null,null,"Complete for assessment"]
[null,null,null,"Automatic calculation"]
[null,null,null,"Cells to be completed by assessor"]
[]
[null,null,null,"***PLEASE READ***\nInstructions: Please use this tab to input the organisation's waste arisings data. \nPlease note: This tab includes space for the most common waste types. If the organisation has waste arisings from sources not listed in this tab, please use the 'Other waste' tab to include these."]
[]
[null,null,null,null,null,null,"Organisation name",null,"Assessor name"]
[null,null,null,null,null,null,"Date spreadsheet completed",null,"Type of Service"]
[null,null,null,null,null,null,"Data year end date"]
[null,null,null,null,null,{"$f":"IF(SUM(H19)*SUM(H18)=0,\"\",IF(H18-H19>276,\"Error: Footprint must be completed within 9 months of compliance period end\",\"\"))","v":""}]
[null,null,null,null,null,"Adjustments to benchmark for structural changes",{"$f":"IF(G10=0,\"\",G10)","v":""}]
[null,null,null,null,null,"Adjustments to turnover for structural changes",{"$f":"G11","v":0}]
[]
[]
[null,null,null,null,null,"Units","Year -2",null,null,null,null,"Year -1",null,null,null,null,"Year 0"]
[null,null,null,null,null,null,"Year end date",null,null,null,null,"Year end date",null,null,null,null,"Year end date",null,null,null,null,null,"Activity Data Source","Assessor Comments"]
[null,null,null,null,null,null,{"$f":"IF($H$19=\"\",\"\",DATE(YEAR($H$19)-2,MONTH($H$19),DAY($H$19)))","v":""},null,null,null,null,{"$f":"IF($H$19=\"\",\"\",DATE(YEAR($H$19)-1,MONTH($H$19),DAY($H$19)))","v":""},null,null,null,null,{"$f":"IF($H$19=0,\"\",$H$19)","v":""},null,null,null,null,null,"e.g. e.g. from waste transfer notes, software packages, or spreadsheets,  raw data evidence presented in evidence pack","e.g. explanation of data quality, large year-on-year changes,etc."]
[]
[null,null,null,"Waste Code","Waste Type","Unit","Total","Reuse","Recycle","Energy recovery","Disposal","Total","Reuse","Recycle","Energy recovery","Disposal","Total","Reuse","Recycle","Energy recovery","Disposal"]
[null,null,null,"01","WASTES RESULTING FROM EXPLORATION, MINING, QUARRYING, AND PHYSICAL AND CHEMICAL TREATMENT OF MINERALS","Tonnes",{"$f":"IF(SUM(H30:K30)=0,\"-\",SUM(H30:K30))","v":"-"},{"$f":"IF(SUM(H31:H53)=0,\"-\",SUM(H31:H53))","v":"-"},{"$f":"IF(SUM(I31:I53)=0,\"-\",SUM(I31:I53))","v":"-"},"-","-",{"$f":"IF(SUM(M30:P30)=0,\"-\",SUM(M30:P30))","v":"-"},{"$f":"IF(SUM(M31:M53)=0,\"-\",SUM(M31:M53))","v":"-"},{"$f":"IF(SUM(N31:N53)=0,\"-\",SUM(N31:N53))","v":"-"},"-","-",{"$f":"IF(SUM(R30:U30)=0,\"-\",SUM(R30:U30))","v":"-"},{"$f":"IF(SUM(R31:R53)=0,\"-\",SUM(R31:R53))","v":"-"},{"$f":"IF(SUM(S31:S53)=0,\"-\",SUM(S31:S53))","v":"-"},"-","-"]
{"$rows_left_out":890}
{"sheet":"Reduction","index":5,"n_rows":60,"n_cols":11,"rows_kept":60,"cut":false,"hidden":false,"merged":[[60,3,69,10],[14,4,16,4],[38,3,38,7]]}
[]
[]
[]
[null,null,null,"Carbon Trust Certification Limited"]
[null,null,null,"Organisational Waste Calculation - Reduction"]
[]
[]
[]
[]
[]
[null,null,null,"Input Required"]
[null,null,null,"Automatic calculation"]
[null,null,null,"Cells to be completed by assessor"]
[]
[null,null,null,null,"Units",{"$f":"'Waste calculation'!G21","v":"Year -2"},{"$f":"'Waste calculation'!$L$21","v":"Year -1"},{"$f":"'Waste calculation'!$Q$21","v":"Year 0"}]
[null,null,null,null,null,"Year end date","Year end date","Year end date"]
[null,null,null,null,null,{"$f":"IF('Waste calculation'!$G$23=\"\",\"\",$G$23)","v":""},{"$f":"IF('Waste calculation'!$L$23=\"\",\"\",$L$23)","v":""},{"$f":"IF('Waste calculation'!$Q$23=\"\",\"\",$Q$23)","v":""}]
[]
[null,null,null,"Waste total and benchmarks (unadjusted)"]
[null,null,null,"Total waste","Tonnes",{"$f":"'Waste calculation'!G915","v":"-"},{"$f":"'Waste calculation'!L915","v":"-"},{"$f":"'Waste calculation'!Q915","v":"-"}]
[]
[null,null,null,"Benchmark denominator (specify below)",null,null,null,null,null,"Comments","Assessor comments:"]
[]
[null,null,null,"Turnover","£mn"]
[]
[null,null,null,"Adjustments"]
[null,null,null,"To ensure each year is measuring the same boundary of organisation, please record any adjustments for "]
[null,null,null,"    any structural changes (e.g., divestments, acquisitions, outsourcing NOT organic growth), or upstream/downstream arisings "]
[null,null,null,"Any adjustments will be SUBTRACTED from the totals"]
[null,null,null,"   - please record any adjustments that should be subtracted as a positive number"]
{"$rows_left_out":31}
{"sheet":"Data sources","index":6,"n_rows":64,"n_cols":7,"rows_kept":64,"cut":false,"hidden":false,"merged":[[64,3,77,6],[63,3,63,5],[13,3,13,6]]}
[]
[]
[]
[null,null,null,"Carbon Trust Certification Limited"]
[null,null,null,"Organisational Waste Calculation - Data Sources and Checking"]
[]
[]
[]
[]
[]
[null,null,null,"Input Required"]
[null,null,null,"Cells to be completed by assessor"]
[]
[null,null,null,"Please list the data sources that have been used in completing this spreadsheet. This should include the source file name (if applicable), what data is included in that file, and the contact at the customer's organisation that supplied this data. Where possible, source files should be submitted as part of the evidence pack."]
[]
[null,null,null,"Please insert more rows if required"]
[]
[null,null,null,"File name","Data included","Data supplied by"]
[]
[]
[]
[]
[]
[]
[]
[]
[]
[]
[]
[]
{"$rows_left_out":35}
{"sheet":"Summary of Results","index":7,"n_rows":22,"n_cols":8,"rows_kept":22,"cut":false,"hidden":false,"merged":[]}
[]
[]
[]
[null,null,null,"Carbon Trust Certification Limited"]
[null,null,null,"Organisational Footprint Calculation - Summary of Results"]
[]
[]
[]
[]
[]
[null,null,null,"FOOTPRINT"]
[]
[null,null,null,null,{"$f":"Reduction!F15","v":"Year -2"},{"$f":"Reduction!G15","v":"Year -1"},{"$f":"Reduction!H15","v":"Year 0"}]
[null,null,null,"Absolute waste arisings (tonnes)",{"$f":"Reduction!F20","v":"-"},{"$f":"Reduction!G20","v":"-"},{"$f":"Reduction!H20","v":"-"}]
[]
[null,null,null,"REDUCTION / HIERARCHY IMPROVEMENT"]
[]
[null,null,null,null,"Historical Data","Current Data","Reduction/improvement %","Result"]
[null,null,null,"Absolute waste arisings (tonnes)",{"$f":"Reduction!G53","v":"-"},{"$f":"Reduction!H53","v":"-"},{"$f":"Reduction!K53","v":"-"},{"$f":"Reduction!J53","v":"-"}]
[null,null,null,"Relative benchmark",{"$f":"Reduction!G54","v":"-"},{"$f":"Reduction!H54","v":"-"},{"$f":"Reduction!K54","v":"-"},{"$f":"Reduction!J54","v":"-"}]
[null,null,null,"Turnover benchmark",{"$f":"Reduction!G55","v":"-"},{"$f":"Reduction!H55","v":"-"},{"$f":"Reduction!K55","v":"-"},{"$f":"Reduction!J55","v":"-"}]
[null,null,null,"Hierarchy movement",{"$f":"'Waste hierarchy calculation'!D24","v":"-"},{"$f":"'Waste hierarchy calculation'!E24","v":"-"},{"$f":"'Waste hierarchy calculation'!G24","v":"-"},{"$f":"Reduction!J56","v":"-"}]

{"sheet":"Checklist","index":8,"n_rows":23,"n_cols":7,"rows_kept":23,"cut":false,"hidden":false,"merged":[[13,6,14,6]]}
[]
[]
[]
[null,null,null,"Carbon Trust Certification Limited"]
[null,null,null,"Organisational Footprint Calculation - Assessor Checklist"]
[]
[]
[]
[]
[]
[null,null,null,"Issue",null,null,"Action"]
[]
[null,null,null,"Are there any unusual years in the data?","No",null,{"$f":"IF(E13=\"yes\",\"Explain why in 'any other comments' box on 'Footprint Calculation' sheet\",\"-\")","v":"-"}]
[null,null,null,"Are there any estimated numbers in the data?","No",null,{"$f":"IF(E14=\"yes\",\"If a number is estimated, indicate this in the comments box on the same row and provide rationale\",\"-\")","v":"-"}]
[]
[null,null,null,"Has the organisation acquired any businesses over the last 3 years?","No",null,{"$f":"IF(E16=\"yes\",\"Use Adjustments sheet to split out emissions from acquired businesses\",\"-\")","v":"-"}]
[null,null,null,"Has the organisation divested any businesses over the last 3 years?","No",null,{"$f":"IF(E17=\"yes\",\"Use Adjustments sheet to split out emissions from divested businesses\",\"-\")","v":"-"}]
[]
[null,null,null,"Does the organisation outsource any significant operations, and has the proportion of outsourced business changed over the last 3 years?","No",null,{"$f":"IF(E19=\"yes\",\"If part of emissions reduction may be due to increase in outsourcing, use the adjustments sheet to split this out\",\"-\")","v":"-"}]
[]
[null,null,null,"Does  the organisation generate food waste?","No",null,{"$f":"IF(E21=\"yes\",\"Please notify CT\",\"-\")","v":"-"}]
[]
[null,null,null,"Have you asked all these questions?","Yes",null,{"$f":"IF(E23=\"yes\",\"-\",\"Data may be incomplete\")","v":"-"}]

{"sheet":"Assessor footprint","index":9,"n_rows":49,"n_cols":11,"rows_kept":49,"cut":false,"hidden":false,"merged":[[17,4,17,5],[18,4,18,5],[19,4,19,5],[20,4,20,5],[25,4,25,5],[21,4,21,5],[22,4,22,5],[23,4,23,5],[24,4,24,5]]}
[]
[]
[]
[null,null,null,"Carbon Trust Certification Limited"]
[null,null,null,"Organisational Footprint Calculation - Assessor Travel Footprint"]
[]
[]
[]
[]
[]
[null,null,null,"Cells to be completed by assessor"]
[null,null,null,"Automatic calculation"]
[]
[null,null,null,"For assessor use only:"]
[null,null,null,null,"Assessors: Please calculate the footprint for your travel related to this assessment"]
[]
[]
[null,null,null,null,"Description",null,"Mode of Transport","Units (e.g. miles/km/litres)","Use (Number of miles/km/litres)","Emission factor (kgCO2e / unit)","Footprint (kgCO2)"]
[null,null,null,"Example","2 visits to Hull office ",null,"petrol car","miles",77,{"$f":"G48","v":0.25167209600000001},{"$f":"I19*J19","v":19.378751392000002}]
[null,null,null,1,null,null,null,null,null,null,{"$f":"IF(I20=\"\",\"\",I20*J20)","v":""}]
[null,null,null,2,null,null,null,null,null,null,""]
[null,null,null,3,null,null,null,null,null,null,""]
[null,null,null,4,null,null,null,null,null,null,""]
[null,null,null,5,null,null,null,null,null,null,""]
[null,null,null,6,null,null,null,null,null,null,""]
[null,null,null,7,null,null,null,null,null,null,""]
[]
[null,null,null,null,null,null,null,null,null,"Total footprint",{"$f":"SUM(K20:K26)","v":0}]
[null,null,null,null,"Emission factors"]
[]
{"$rows_left_out":20}
{"sheet":"Emissions Factors","index":10,"n_rows":127,"n_cols":11,"rows_kept":127,"cut":false,"hidden":false,"merged":[[52,4,53,4],[99,4,99,7],[79,4,79,6],[87,4,87,7],[56,4,57,4],[88,4,88,5],[89,4,89,7],[95,4,95,7]]}
[]
[]
[]
[null,null,null,"Carbon Trust Certification Limited"]
[null,null,null,"Organisational Footprint Calculation - Emissions Factors"]
[]
[]
[]
[]
[]
[null,null,null,"Emissions factors - owned transport"]
[null,null,null,"Should be measured by the most accurate possible method. "]
[null,null,null,"For cars, the order of preference is as follows:"]
[null,null,null,"  1. Use actual amount of fuel purchased"]
[null,null,null,"  2. Base estimates on type of vehicles"]
[null,null,null,"  3. Use an average figure for all cars"]
[]
[null,null,null,null,"Emissions by litres of fuel used"]
[null,null,null,"1.","Diesel","litres",{"$f":"G53","v":2.6008}]
[null,null,null,null,"Petrol","litres",{"$f":"G57","v":2.2143999999999999}]
[null,null,null,null,"LPG","litres",{"$f":"G69","v":1.4928999999999999}]
[]
[null,null,null,"2.","Emissions by car type"]
[null,null,null,null,null,null,"Petrol","Diesel","Unknown"]
[null,null,null,null,"Mini","km",0.14357,0.10505,0.14299999999999999]
[null,null,null,null,"Supermini","km",0.16341,0.13741999999999999,0.15981000000000001]
[null,null,null,null,"Lower Medium","km",0.1948,0.15548000000000001,0.17867]
[null,null,null,null,"Upper","km",0.22486,0.17224,0.19314999999999999]
[null,null,null,null,"Executive","km",0.26074999999999998,0.19536000000000001,0.22158]
[null,null,null,null,"Luxury","km",0.34564,0.23601,0.30488999999999999]
{"$rows_left_out":97}